{"text_format":"1","workbook":"xlsx","n_sheets":7,"sheets":["Instructions","Cover","Site Inputs","Lookup Tables","Drainage Tables","DA #","Design Summary"],"not_rendered":{"charts":0,"images":0,"macros":1,"external_links":0,"defined_names":10,"comments":0,"pivot_tables":0},"unopened":[],"bounds":{"document_bytes":16777216,"sheet_cells":100000,"rows_first":2000,"rows_last":500,"rows_between":2000,"halvings":0,"cell_chars":16384,"cell_head_chars":4096},"cells_cut":0,"cells_raw":0,"read":"whole","date_system":"1900"}

{"sheet":"Instructions","index":0,"n_rows":90,"n_cols":3,"rows_kept":90,"cut":false,"hidden":false,"merged":[[61,1,61,2],[3,1,3,2],[19,1,19,2],[25,1,25,2],[26,1,26,2],[34,1,34,2],[88,1,88,2],[89,1,89,2],[62,1,62,2],[63,1,63,2],[66,1,66,2],[80,1,80,2],[86,1,86,2],[87,1,87,2]]}
[]
[null,null,"KC Compliance Calculator Instructions"]
[]
[null,"Instructions Worksheet"]
[]
[null,"1.","Light blue cells are to be filled in by the designer."]
[null,"2.","Gray cells are automatically calculated based on the designer inputs. These cells are locked and should not be changed."]
[null,"3.","Green cells are to be filled in by the Approving Jurisdiction"]
[null,"4."]
[]
[]
[]
[]
[null,"5."]
[]
[]
[]
[]
[]
[null,"Cover Worksheet"]
{"$rows_left_out":71}
{"sheet":"Cover","index":1,"n_rows":167,"n_cols":12,"rows_kept":167,"cut":false,"hidden":false,"merged":[[111,2,111,12],[112,2,112,12],[121,2,121,12],[123,2,123,12],[124,2,124,12],[125,2,125,12],[107,2,107,12],[108,2,108,12],[109,2,109,12],[119,2,119,12],[120,2,120,12],[69,1,69,6],[75,1,75,12],[74,1,74,12],[77,1,77,6],[77,7,77,9],[79,11,79,12],[100,7,100,12],[101,7,101,9],[101,11,101,12],[100,1,103,6],[102,7,103,9],[102,10,103,10],[102,11,103,12],[82,1,82,12],[83,1,83,6],[83,7,83,9],[83,10,83,12],[85,11,85,12],[86,11,86,12],[87,11,87,12],[88,1,88,12],[89,1,89,6],[89,7,89,12],[90,7,90,12],[9,7,9,10],[55,1,55,12],[56,1,56,12],[57,1,57,6],[57,7,57,12],[58,7,58,12],[59,7,59,12],[60,7,60,12],[62,7,62,12],[34,3,37,11],[13,1,13,12],[24,2,28,11],[30,1,30,12],[11,2,11,6],[11,7,11,10],[17,2,18,7],[17,9,18,9],[17,10,18,10],[10,7,10,10],[40,1,40,12],[44,6,45,7],[46,6,47,7],[48,6,49,7],[50,6,51,7],[1,1,1,12],[2,1,2,12],[4,7,4,10],[6,7,6,10],[5,7,5,10],[3,2,3,6],[4,2,4,6],[5,2,5,6],[6,2,6,6],[3,7,3,10],[8,2,8,6],[9,2,9,6],[10,2,10,6],[8,7,8,10],[131,1,131,12],[138,1,138,12],[146,8,146,10],[145,1,145,7],[146,1,146,7],[145,8,145,10],[61,7,61,12],[64,7,64,12],[66,7,66,12],[76,1,76,12],[70,7,70,12],[71,7,71,9],[71,11,71,12],[65,7,65,12],[63,7,63,12],[70,1,73,6],[72,7,73,9],[72,10,73,10],[72,11,73,12],[52,6,53,7],[145,11,145,12],[146,11,146,12],[79,7,79,9],[80,7,80,9],[81,7,81,9],[78,7,78,9],[77,10,78,12],[80,11,81,12],[130,1,130,12],[85,7,85,9],[86,7,86,9],[87,7,87,9],[118,2,118,12],[99,1,99,6],[84,7,84,9],[91,1,91,12],[92,1,92,6],[92,7,92,12],[126,2,126,12],[127,2,127,12],[128,2,128,12],[104,1,104,12],[106,2,106,12],[110,2,110,12],[43,1,43,7],[45,9,47,11],[53,9,53,10],[50,11,52,11],[50,9,52,10],[165,1,165,7],[165,8,165,10],[165,11,165,12],[129,1,129,12],[84,11,84,12],[105,1,105,12],[93,7,93,12],[94,7,94,12],[95,7,95,12],[96,7,96,12],[97,7,97,12],[98,7,98,12],[122,2,122,12],[113,2,113,12],[114,2,114,12],[115,2,115,12],[116,2,116,12],[117,2,117,12],[147,1,147,12],[166,1,166,7],[166,8,166,10],[166,11,166,12],[154,1,154,7],[154,8,154,10],[154,11,154,12],[155,1,155,7],[155,8,155,10],[155,11,155,12],[156,1,156,12],[158,1,163,12]]}
[]
[null,"General Requirements"]
[null,"Project Information"]
[null,null,"Project Name:"]
[null,null,"Date:"]
[null,null,"Address:"]
[null,null,"Nearest Intersection:"]
[]
[null,null,"Project Type:",null,null,null,null,{"$f":"IF('Site Inputs'!$D$4=\"\",\"\",'Site Inputs'!$D$4)","v":""}]
[null,null,"System Type:",null,null,null,null,{"$f":"IF('Site Inputs'!$D$5=\"\",\"\",'Site Inputs'!$D$5)","v":""}]
[null,null,"Proposed Land Use:",null,null,null,null,{"$f":"IF('Site Inputs'!$D$6=\"\",\"\",'Site Inputs'!$D$6)","v":""}]
[null,null,"Input Value Basis:",null,null,null,null,{"$f":"IF('Site Inputs'!$D$7=\"\",\"\",'Site Inputs'!$D$7)","v":""}]
[]
[null,"Site Parameters"]
[null,null,"Total Disturbed Area of Site",null,null,null,null,null,null,{"$f":"IF('Site Inputs'!$D$9=0,\"\",'Site Inputs'!$D$9/43560)","v":""},"acres"]
[null,null,"Total Proposed Impervious Area",null,null,null,null,null,null,null,"square feet"]
[]
[null,null,"Single-family/duplex dwelling part of a larger common plan of development?",null,null,null,null,null,null,null,"(Select Yes/No)"]
[]
[null,null,null,"Lot Size ",null,null,null,null,null,null,"acres"]
{"$rows_left_out":148}
{"sheet":"Site Inputs","index":2,"n_rows":244,"n_cols":15,"rows_kept":244,"cut":false,"hidden":false,"merged":[[65,1,65,3],[52,4,52,12],[3,3,3,6],[12,1,12,3],[11,1,11,3],[14,1,14,3],[35,1,35,3],[18,1,18,3],[16,1,16,3],[17,1,17,3],[33,1,33,3],[34,1,34,3],[30,1,30,4],[31,1,31,3],[32,1,32,3],[15,1,15,3],[4,3,4,6],[6,3,6,6],[5,3,5,6],[25,1,25,3],[40,1,40,3],[36,1,36,3],[37,1,37,3],[38,1,38,3],[39,1,39,3],[13,1,13,3],[49,1,49,3],[41,1,41,3],[48,1,48,3],[44,1,44,3],[45,1,45,3],[46,1,46,3],[47,1,47,3],[50,1,50,3],[58,1,58,3],[59,1,59,3],[61,1,61,3],[64,1,64,3],[63,1,63,3],[53,1,53,3],[55,1,55,3],[56,1,56,3],[60,1,60,3],[62,1,62,3],[57,1,57,3],[54,1,54,3],[52,1,52,3]]}
[]
[null,"Site Inputs Worksheet"]
[]
[null,"Project and Development Type:"]
[null,"System Type:"]
[null,"Proposed Land Use:"]
[null,"Input Value Basis:"]
[null,"Assumed Percent Impervious Coverage:",null,{"$f":"IF($D$7=\"Actual measured values based on improvement plans\", \"NA\", IF($D$7=\"Estimated values based on development type\", IF($D$6<>\"\", IFERROR(VLOOKUP($D$6,'Lookup Tables'!$A$54:$B$64,2,FALSE),\"\"), \"\"), \"\"))","v":""},{"$f":"IF($D$7=\"\",\"Select an Input Value Basis above.\", IF(D7=\"Estimated values based on development type\", IF(D6=\"\",\"Select a Proposed Land Use above.\",\"\"), \"\"))","v":"Select an Input Value Basis above."}]
[null,"Total Disturbed Area ft2:",null,null,{"$f":"IF($D$9=\"\",\"\",(IF($D$9-SUM(Drainage_Area_IDs[Disturbed Drainage Area (ft2)])<>0,\"⮽ Subdivided disturbed drainage areas from the Drainage Area Summary Table does not match the input total disturbed area.\",\"\")))","v":""}]
[]
[null,"Treatment Summary Table"]
[null,"Water Quality Storm Event (PWQ), inches",null,null,1.37]
[null,"Percent of Water Quality Storm to be Retained (PT%)",null,null,{"$f":"IFERROR(IF(D5=\"Separate Storm Sewer System\",VLOOKUP($D$4,'Lookup Tables'!$A$3:$C$7,2,FALSE),IF(D5=\"Combined Sewer System\",VLOOKUP($D$4,'Lookup Tables'!$A$3:$C$7,3,FALSE),0)),0)","v":0},{"$f":"IF(AND(D4=\"\", D5=\"\"),\"\",IF(D5=\"\",\"Select a System Type above\",IF(D4=\"\",\"Select a Project and Development Type above\",\"\")))","v":""}]
[null,"Total Controlled Disturbed Area (Acontrolled), ft2",null,null,{"$f":"IF(SUMIF(Drainage_Area_IDs[Can this drainage area be feasibly controlled?],\"Yes\",Drainage_Area_IDs[Disturbed Drainage Area (ft2)])>0,SUMIF(Drainage_Area_IDs[Can this drainage area be feasibly controlled?],\"Yes\",Drainage_Area_IDs[Disturbed Drainage Area (ft2)]),0)","v":0}]
[null,"Controlled Area Rv (Rvcontrolled)",null,null,{"$f":"0","v":0},"Equation 5602-16"]
[null,"Total Uncontrolled Disturbed Area, ft2",null,null,{"$f":"IF(SUMIF(Drainage_Area_IDs[Can this drainage area be feasibly controlled?],\"No\",Drainage_Area_IDs[Disturbed Drainage Area (ft2)])>0,SUMIF(Drainage_Area_IDs[Can this drainage area be feasibly controlled?],\"No\",Drainage_Area_IDs[Disturbed Drainage Area (ft2)]),0)","v":0}]
[null,"Total Required Retention Volume (RRV), ft3",null,null,{"$f":"IFERROR(($E$12/12)*$E$13*(M66*O66), 0)","v":0},"Equation 5602-9"]
[null,"Uncontrolled Retention Volume, ft3",null,null,{"$f":"SUM(0)","v":0},{"$f":"IFERROR((IF($E$18/$E$17>(1-$E$13),\"⮽ Uncontrolled area is too large. Stormwater management required for portions of uncontrolled area.\",\"☑ Uncontrolled area is within the limit to achieve the total site retention requirements.\")),\"\")","v":""}]
[null,"Adjusted PT% within Controlled Drainage Areas (PT%controlled)",null,null,{"$f":"IFERROR(IF($E$16=0,\"NA\",(12*($E$17)/($E$12*($E$15*$E$14)))),\"\")","v":"NA"},"Equation 5602-15"]
[]
{"$rows_left_out":225}
{"sheet":"Lookup Tables","index":3,"n_rows":80,"n_cols":12,"rows_kept":80,"cut":false,"hidden":true,"merged":[[9,2,9,5],[9,0,9,1]]}
[]
["Project Type","MS4 PT Modifier","CSS PT Modifier"]
["Site Development - New Development",0.85,1]
["Site Development - Redevelopment",0.4,0.85,null,null,null,null,null,"Ia=0.2S","Ia=0.4S","Ia=0.05S","Ia=0.4S"]
["Public Roadway Improvements - New Development",0.4,1,null,null,null,null,"CN","WQ 90% Rv","WQ 90% Rv UnDev","WQ Rv Dev.","10-yr Rv"]
["Public Roadway Improvements - Redevelopment",0.2,0.65,null,null,null,null,26,0,0,0,0]
["Utility Improvements",0,0,null,null,null,null,27,0,0,0,0]
[null,null,null,null,null,null,null,28,0,0,0,0]
[null,null,"CN = 39.168+0.585*I","CN = 60.665+0.3737*I","CN = 74.084+0.2385*I","CN = 80.45+0.1751*I",null,29,0,0,0,0]
["Post -Project Runoff Coefficients",null,"CN, Hydrologic Soil Group",null,null,null,null,30,0,0,0,0]
["Land Cover","Rv","A","B","C","D","% Impervious",31,0,0,0,0]
["Natural Area",0,30,55,70,77,{"$f":"IF((B12-0.05)/0.009<1,0,B12-0.05)/0.009","v":0},32,0,0,0,0]
["Pervious Area",0.25,39,61,74,80,{"$f":"IF((B13-0.05)/0.009<1,0,B13-0.05)/0.009","v":22.222222222222225},33,0,0,0,0]
["Impervious Area",0.95,98,98,98,98,100,34,0,0,0,0]
["Solar Farm - Native",0.4,{"$f":"ROUNDUP(IF(39.168+0.585*$G15>100,100,39.168+0.585*$G15),0)","v":62},{"$f":"ROUNDUP(IF(60.665+0.3737*$G15>100,100,60.665+0.3737*$G15),0)","v":76},{"$f":"ROUNDUP(IF(74.084+0.2385*$G15>100,100,74.084+0.2385*$G15),0)","v":84},{"$f":"ROUNDUP(IF(80.45+0.1751*$G15>100,100,80.45+0.1751*$G15),0)","v":88},38.888888888888893,35,0,0,0,0]
["Solar Farm - Gravel",0.6,75,{"$f":"ROUNDUP(IF(60.665+0.3737*$G16>100,100,60.665+0.3737*$G16),0)","v":84},{"$f":"ROUNDUP(IF(74.084+0.2385*$G16>100,100,74.084+0.2385*$G16),0)","v":89},{"$f":"ROUNDUP(IF(80.45+0.1751*$G16>100,100,80.45+0.1751*$G16),0)","v":92},61.111111111111107,36,0,0,0,0]
["Gravel - Overflow Parking Lots, Trails/Maintenance Paths, Substations",0.6,75,84,89,92,61.111111111111107,37,0,0,0,0]
["Gravel - Primary Parking Lots, Access Driveways, Railroad Ballasts",0.8,88,92,94,96,83.333333333333343,38,0,0,0,0]
["Gravel - Public Road with Compacted Subgrade Material",0.95,98,99,98,98,100,39,0,0,0,0]
["Artificial Turf - No Underdrain System",0.45,66,78,85,89,44.44444444444445,40,0,0,0,0]
{"$rows_left_out":61}
{"sheet":"Drainage Tables","index":4,"n_rows":26,"n_cols":19,"rows_kept":26,"cut":false,"hidden":true,"merged":[[1,17,5,17],[1,1,1,3],[2,1,2,3],[3,1,3,3],[4,1,4,3],[5,1,5,3],[22,1,22,3],[10,1,10,3],[16,1,16,3],[17,1,17,3],[18,1,18,3],[21,1,21,3],[6,1,6,3],[7,1,7,3],[9,4,9,12],[19,1,19,3],[20,1,20,3],[11,1,11,3],[12,1,12,3],[13,1,13,3],[14,1,14,3],[15,1,15,3],[9,1,9,3]]}
[]
[true,"Individual Drainage Area Summary Table ID:",null,null,null,null,null,null,null,null,null,null,null,null,null,null,null,null,"Disturbed Drainage Area (sf)"]
[true,"Is this drainage area controlled?",null,null,null,null,null,null,null,null,null,null,null,null,null,null,null,null,"RRV Prior to Reductions (cf)"]
[true,"Disturbed drainage area (ft2)",null,null,null,null,null,null,null,null,null,null,null,null,null,null,null,null,"RRVreductions  (cf)"]
[true,{"$f":"IF(E3=\"No\", \"Uncontrolled Retention Volume, (ft³)\", IF(AND(E3=\"Yes\", 'Site Inputs'!$E$19=\"NA\"), \"RRV Prior to Reductions, (ft³)\", IF(AND(E3=\"Yes\", 'Site Inputs'!$E$19>0), \"Adjusted RRV Prior to Reductions, (ft³)\", \"RRV Prior to Reductions, (ft³)\")))","v":"RRV Prior to Reductions, (ft³)"},null,null,{"$f":"IFERROR(IF(E3=\"Yes\",IF('Site Inputs'!$E$19=\"NA\",'Site Inputs'!$E$12/12*'Site Inputs'!$E$13*M23*O23,'Site Inputs'!$E$12/12*'Site Inputs'!$E$19*M23*O23),'Site Inputs'!$E$12/12*'Site Inputs'!$E$13*M23*O23),0)","v":0},"Equation 5602-9",null,null,null,null,null,null,null,null,null,null,null,null,"RRV After Reductions (cf)"]
[true,"Pervious Area Weighted Rv",null,null,{"$f":"IF(E3=\"No\",\"NA\",IFERROR((M12*O12+M13*O13+M15*O15+M16*O16+M17*O17+M18*O18+M20*O20+M21*O21)/(M12+M13+M15+M16+M17+M18+M20+M21),\"-\"))","v":"-"},null,null,null,null,null,null,null,null,null,null,null,null,null,"Retention Volume Achieved (cf)"]
[true,"Impervious Area Weighted Rv",null,null,{"$f":"IF(E3=\"No\",\"NA\",IFERROR((O14*M14++M19*O19+O22*M22)/(M14+M19+M22),\"-\"))","v":"-"}]
[true,"Post-Project Condition Weighted CN",null,null,{"$f":"IFERROR((SUMPRODUCT(E12:E22,F12:F22)+SUMPRODUCT(G12:G22,H12:H22)+SUMPRODUCT(I12:I22,J12:J22)+SUMPRODUCT(K12:K22,L12:L22))/M23,\"-\")","v":"-"}]
[true]
[true,{"$f":"\"Post-Project Cover Type Area Table for Drainage Area \"&E2","v":"Post-Project Cover Type Area Table for Drainage Area "},null,null,"Area (ft2)"]
[true,"Cover Type",null,null,"Soil Type A","CN","Soil Type B","CN","Soil Type C","CN","Soil Type D","CN","Total","% Cover","Rv"]
[{"$f":"'Site Inputs'!$E$32","v":false},"Natural Area",null,null,null,{"$f":"VLOOKUP(B12,'Lookup Tables'!$A$12:$F$22,3,FALSE)","v":30},null,{"$f":"VLOOKUP(B12,'Lookup Tables'!$A$12:$F$22,4,FALSE)","v":55},null,{"$f":"VLOOKUP(B12,'Lookup Tables'!$A$12:$F$22,5,FALSE)","v":70},null,{"$f":"VLOOKUP(B12,'Lookup Tables'!$A$12:$F$22,6,FALSE)","v":77},{"$f":"E12+G12+I12+K12","v":0},{"$f":"IF(M23>0,M12/M23,0)","v":0},{"$f":"VLOOKUP(B12,'Lookup Tables'!$A$12:$F$22,2,FALSE)","v":0}]
[{"$f":"'Site Inputs'!$E$33","v":false},"Pervious Area",null,null,null,{"$f":"VLOOKUP(B13,'Lookup Tables'!$A$12:$F$22,3,FALSE)","v":39},null,{"$f":"VLOOKUP(B13,'Lookup Tables'!$A$12:$F$22,4,FALSE)","v":61},null,{"$f":"VLOOKUP(B13,'Lookup Tables'!$A$12:$F$22,5,FALSE)","v":74},null,{"$f":"VLOOKUP(B13,'Lookup Tables'!$A$12:$F$22,6,FALSE)","v":80},{"$f":"E13+G13+I13+K13","v":0},{"$f":"IF(M23>0,M13/M23,0)","v":0},{"$f":"VLOOKUP(B13,'Lookup Tables'!$A$12:$F$22,2,FALSE)","v":0.25}]
[{"$f":"'Site Inputs'!$E$34","v":false},"Impervious Area",null,null,null,{"$f":"VLOOKUP(B14,'Lookup Tables'!$A$12:$F$22,3,FALSE)","v":98},null,{"$f":"VLOOKUP(B14,'Lookup Tables'!$A$12:$F$22,4,FALSE)","v":98},null,{"$f":"VLOOKUP(B14,'Lookup Tables'!$A$12:$F$22,5,FALSE)","v":98},null,{"$f":"VLOOKUP(B14,'Lookup Tables'!$A$12:$F$22,6,FALSE)","v":98},0,{"$f":"IF(M23>0,M14/M23,0)","v":0},{"$f":"VLOOKUP(B14,'Lookup Tables'!$A$12:$F$22,2,FALSE)","v":0.95}]
[{"$f":"'Site Inputs'!$E$35","v":false},"Solar Farm - Native",null,null,null,{"$f":"VLOOKUP(B15,'Lookup Tables'!$A$12:$F$22,3,FALSE)","v":62},null,{"$f":"VLOOKUP(B15,'Lookup Tables'!$A$12:$F$22,4,FALSE)","v":76},null,{"$f":"VLOOKUP(B15,'Lookup Tables'!$A$12:$F$22,5,FALSE)","v":84},null,{"$f":"VLOOKUP(B15,'Lookup Tables'!$A$12:$F$22,6,FALSE)","v":88},0,{"$f":"IF(M23>0,M15/M23,0)","v":0},{"$f":"VLOOKUP(B15,'Lookup Tables'!$A$12:$F$22,2,FALSE)","v":0.4}]
[{"$f":"'Site Inputs'!$E$36","v":false},"Solar Farm - Gravel",null,null,null,{"$f":"VLOOKUP(B16,'Lookup Tables'!$A$12:$F$22,3,FALSE)","v":75},null,{"$f":"VLOOKUP(B16,'Lookup Tables'!$A$12:$F$22,4,FALSE)","v":84},null,{"$f":"VLOOKUP(B16,'Lookup Tables'!$A$12:$F$22,5,FALSE)","v":89},null,{"$f":"VLOOKUP(B16,'Lookup Tables'!$A$12:$F$22,6,FALSE)","v":92},0,{"$f":"IF(M23>0,M16/M23,0)","v":0},{"$f":"VLOOKUP(B16,'Lookup Tables'!$A$12:$F$22,2,FALSE)","v":0.6}]
[{"$f":"'Site Inputs'!$E$37","v":false},"Gravel - Overflow Parking Lots, Trails/Maintenance Paths, Substations",null,null,null,{"$f":"VLOOKUP(B17,'Lookup Tables'!$A$12:$F$22,3,FALSE)","v":75},null,{"$f":"VLOOKUP(B17,'Lookup Tables'!$A$12:$F$22,4,FALSE)","v":84},null,{"$f":"VLOOKUP(B17,'Lookup Tables'!$A$12:$F$22,5,FALSE)","v":89},null,{"$f":"VLOOKUP(B17,'Lookup Tables'!$A$12:$F$22,6,FALSE)","v":92},0,{"$f":"IF(M23>0,M17/M23,0)","v":0},{"$f":"VLOOKUP(B17,'Lookup Tables'!$A$12:$F$22,2,FALSE)","v":0.6}]
[{"$f":"'Site Inputs'!$E$38","v":false},"Gravel - Primary Parking Lots, Access Driveways, Railroad Ballasts",null,null,null,{"$f":"VLOOKUP(B18,'Lookup Tables'!$A$12:$F$22,3,FALSE)","v":88},null,{"$f":"VLOOKUP(B18,'Lookup Tables'!$A$12:$F$22,4,FALSE)","v":92},null,{"$f":"VLOOKUP(B18,'Lookup Tables'!$A$12:$F$22,5,FALSE)","v":94},null,{"$f":"VLOOKUP(B18,'Lookup Tables'!$A$12:$F$22,6,FALSE)","v":96},0,{"$f":"IF(M23>0,M18/M23,0)","v":0},{"$f":"VLOOKUP(B18,'Lookup Tables'!$A$12:$F$22,2,FALSE)","v":0.8}]
[{"$f":"'Site Inputs'!$E$39","v":false},"Gravel - Public Road with Compacted Subgrade Material",null,null,null,{"$f":"VLOOKUP(B19,'Lookup Tables'!$A$12:$F$22,3,FALSE)","v":98},null,{"$f":"VLOOKUP(B19,'Lookup Tables'!$A$12:$F$22,4,FALSE)","v":99},null,{"$f":"VLOOKUP(B19,'Lookup Tables'!$A$12:$F$22,5,FALSE)","v":98},null,{"$f":"VLOOKUP(B19,'Lookup Tables'!$A$12:$F$22,6,FALSE)","v":98},0,{"$f":"IF(M23>0,M19/M23,0)","v":0},{"$f":"VLOOKUP(B19,'Lookup Tables'!$A$12:$F$22,2,FALSE)","v":0.95}]
[{"$f":"'Site Inputs'!$E$40","v":false},"Artificial Turf - No Underdrain System",null,null,null,{"$f":"VLOOKUP(B20,'Lookup Tables'!$A$12:$F$22,3,FALSE)","v":66},null,{"$f":"VLOOKUP(B20,'Lookup Tables'!$A$12:$F$22,4,FALSE)","v":78},null,{"$f":"VLOOKUP(B20,'Lookup Tables'!$A$12:$F$22,5,FALSE)","v":85},null,{"$f":"VLOOKUP(B20,'Lookup Tables'!$A$12:$F$22,6,FALSE)","v":89},0,{"$f":"IF(M23>0,M20/M23,0)","v":0},{"$f":"VLOOKUP(B20,'Lookup Tables'!$A$12:$F$22,2,FALSE)","v":0.45}]
{"$rows_left_out":7}
{"sheet":"DA #","index":5,"n_rows":854,"n_cols":46,"rows_kept":854,"cut":false,"hidden":true,"merged":[[42,44,43,44],[42,43,43,43],[19,1,19,2],[3,1,3,2],[4,1,4,2],[5,1,5,2],[6,1,6,2],[7,1,7,2],[8,1,8,2],[9,1,9,2],[14,1,14,2],[15,1,15,2],[16,1,16,2],[17,1,17,2],[36,1,36,2],[20,1,20,2],[21,1,21,2],[38,1,38,2],[39,1,39,2],[42,1,43,1],[42,2,43,2],[23,1,23,2],[24,1,24,2],[25,1,25,2],[30,1,30,3],[31,1,31,2],[32,1,32,2],[33,1,33,2],[34,1,34,2],[35,1,35,2],[37,1,37,2],[42,3,43,3],[42,42,43,42],[67,1,67,2],[68,1,68,2],[83,1,83,2],[42,36,42,39],[42,41,43,41],[42,20,42,23],[42,24,42,27],[42,28,42,31],[42,32,42,35],[42,6,43,6],[42,7,43,7],[42,8,43,8],[42,9,42,11],[42,12,42,15],[42,16,42,19],[66,1,66,2],[84,1,84,2],[92,1,92,2],[93,1,93,2],[85,1,85,2],[86,1,86,2],[87,1,87,2],[90,1,90,2],[91,1,91,2]]}
[]
[null,{"$f":"\"Design Worksheet for Drainage Area \"&D4&\"\"","v":"Design Worksheet for Drainage Area "}]
[]
[null,"Drainage Area ID"]
[null,"Is this drainage area controlled?",null,null,{"$f":"IF(D5=\"No\",\"Check input in the Drainage Area Summary Table in the Summary sheet. If this drainage area is truly meant to be uncontrolled, delete this tab.\",\"\")","v":""}]
[null,"Disturbed drainage area (ft2)",null,null,{"$f":"IF(D6=\"-\",\"Input the disturbed drainage area in the Drainage Area Summary Table in the Summary sheet.\",\"\")","v":""}]
[null,{"$f":"IF('Site Inputs'!$E$19=\"NA\",\"RRV Prior to Reductions, (ft³)\", \"Adjusted RRV Prior to Reductions, (ft³)\")","v":"RRV Prior to Reductions, (ft³)"},null,null,{"$f":"IF(D7=\"-\",\"Complete cover type area calcuations for this drainage area in the Summary sheet.\",\"\")","v":""}]
[null,"Pervious Area Weighted Rv"]
[null,"Impervious Area Weighted Rv"]
[null,"Post-Project Condition Weighted CN"]
[]
[]
[null,"Required Retention Volume Reductions (RRVReductions)"]
[]
[null,"Preservation/Restoration, & Disconnection RRVreductions",null,"Natural or Pervious Area Footprint (ft2)","Pervious Tributary Area (ft2) \n(PTributary Area)","Impervious Tributary Area (ft2)\n(ITributary Area)","Runoff Reduction Credit","Retention Volume Credited (ft3)\nRRVreduction"]
[null,"Sheetflow to Natural Area",null,null,null,null,{"$f":"VLOOKUP(B16,'Lookup Tables'!$A$25:$B$249,2,FALSE)","v":1},{"$f":"IFERROR((IF(D16>0.5*(F16+E16),'Site Inputs'!$E$13/12*(0.95*F16)*G16,0)),0)","v":0},"Equations 5602-1 and 5602-2"]
[null,"Sheetflow to Pervious Area",null,null,null,null,{"$f":"VLOOKUP(B17,'Lookup Tables'!$A$25:$B$249,2,FALSE)","v":0.5},{"$f":"IFERROR(IF(D17>F17,'Site Inputs'!$E$13/12*(0.95*F17)*G17,0),0)","v":0},"Equations 5602-3 and 5602-4"]
[null,"Downspout Disconnection",null,null,null,null,{"$f":"VLOOKUP(B18,'Lookup Tables'!$A$25:$B$249,2,FALSE)","v":0.25},{"$f":"IFERROR(IF(D18>F18,'Site Inputs'!$E$12/12*(0.95*F18)*G18,0),0)","v":0},"Equations 5602-5 and 5602-6"]
[]
[null,"Tree RRVreductions",null,"Number of Trees (Each)","Runoff Reduction Credit (ft3/tree)","Retention Volume Credited (ft3)\nRRVreduction"]
{"$rows_left_out":835}
{"sheet":"Design Summary","index":6,"n_rows":10,"n_cols":5,"rows_kept":10,"cut":false,"hidden":false,"merged":[[9,4,9,7],[3,1,9,1]]}
[]
[null,"Design Summary Worksheet"]
[]
[null,"Total Site Summary","Total Disturbed Area (ft2):",{"$f":"'Site Inputs'!$D$9","v":0},{"$f":"IF($D$4=0,\"\",(IF($D$4-SUM(Drainage_Area_IDs[Disturbed Drainage Area (ft2)])<>0,\"⮽ Subdivided disturbed drainage areas from the Drainage Area Summary Table in the Site Input tab does not match the input total disturbed area.\",\"\")))","v":""}]
[null,null,"Total Site Rv:",{"$f":"IFERROR(('Site Inputs'!M66*'Site Inputs'!O66)/'Site Inputs'!$D$9, 0)","v":0}]
[null,null,"Total RRV Prior to Reductions (ft3)",{"$f":"0","v":0}]
[null,null,"Total RRV Reductions  (ft3)",{"$f":"0","v":0}]
[null,null,"Total RRV After Reductions (ft3)",{"$f":"0","v":0}]
[null,null,"Total Retention Volume Achieved (ft3)",{"$f":"0","v":0},{"$f":"IF(D8=0,\"\",IF(ROUND(D9,0)>=ROUND(D8,0),\"☑ Total Required Retention Volume achieved!\",\"⮽ Additional retention required.\"))","v":""}]
[null,null,"Percent WQv Control Achieved",{"$f":"IF(D9=0,0,((D9+D7)*12)/('Site Inputs'!$E$12*(D4*D5)))","v":0},{"$f":"IF(D10>='Site Inputs'!$E$13,\"☑ Required percent site control achieved!\",\"⮽ Additional site control required.\")","v":"☑ Required percent site control achieved!"}]